{"text_format":"1","workbook":"xlsx","n_sheets":11,"sheets":["Capa","Grupo A","Grupo B","Grupo C","Grupo D","Grupo E","Grupo F","Grupo G","Grupo H","8°'s e 4°'s","Finais"],"not_rendered":{"charts":0,"images":2,"macros":1,"external_links":0,"defined_names":0,"comments":2,"pivot_tables":0},"unopened":[],"bounds":{"document_bytes":16777216,"sheet_cells":100000,"rows_first":2000,"rows_last":500,"rows_between":2000,"halvings":0,"cell_chars":16384,"cell_head_chars":4096},"cells_cut":0,"cells_raw":0,"read":"whole","date_system":"1900"}

{"sheet":"Capa","index":0,"n_rows":22,"n_cols":6,"rows_kept":22,"cut":false,"hidden":false,"merged":[[21,5,21,12],[16,5,18,12],[2,5,15,12],[19,5,19,12],[20,5,20,12]]}
[]
[]
[null,null,null,null,null,"Feito por Gabriel Cavalcante Bezerra de Souza, DeMolay do Capítulo Branca Dias n° 800, jurisdicionado ao Supremo Conselho da Ordem DeMolay para a República Federativa do Brasil."]
[]
[]
[]
[]
[]
[]
[]
[]
[]
[]
[]
[]
[]
[null,null,null,null,null,"Corpo patrocinador: Loja Maçônica Branca Dias N° 1"]
[]
[]
[null,null,null,null,null,"DeMolay Card: 29932"]
[null,null,null,null,null,"Contato: (83) 9802-5366"]
[null,null,null,null,null,"Mestre Conselheiro da Gestão 2014.1"]

{"sheet":"Grupo A","index":1,"n_rows":23,"n_cols":24,"rows_kept":23,"cut":false,"hidden":false,"merged":[[7,1,7,11],[12,10,12,11],[13,10,13,11],[14,10,14,11],[8,7,8,9],[11,10,11,11],[12,3,12,4],[13,3,13,4],[14,3,14,4],[9,5,9,6],[10,5,10,6],[11,5,11,6],[12,5,12,6],[13,5,13,6],[14,5,14,6],[11,3,11,4],[9,15,9,16],[8,15,8,16],[10,15,10,16],[11,15,11,16],[12,15,12,16],[8,3,8,4],[9,3,9,4],[8,5,8,6],[8,10,8,11],[10,3,10,4],[9,10,9,11],[10,10,10,11]]}
[]
[]
[]
[]
[]
[]
[]
[null,"Grupo A"]
[null,"Data","Hora","Local",null,"Seleção",null,"Placar",null,null,"Seleção",null,null,null,null,"Equipe",null,"Pts","V","E","D","GP","GC","SG"]
[null,"2014-06-12","17:00:00","São Paulo",null,"Brasil",null,null,"x",null,"Croácia",null,{"$f":"IF(OR(H10=\"\",J10=\"\"),\"\",IF(H10=J10,1,IF(H10>J10,3,0)))","v":""},{"$f":"IF(OR(J10=\"\",H10=\"\"),\"\",IF(J10=H10,1,IF(J10>H10,3,0)))","v":""},"1°",{"$f":"VLOOKUP(M19,A$19:F$22,2)","v":"Croácia"},null,{"$f":"VLOOKUP($M19,$A$19:$F$22,3)","v":0},{"$f":"VLOOKUP($M19,$A$19:$J$22,8)","v":0},{"$f":"VLOOKUP($M19,$A$19:$J$22,9)","v":0},{"$f":"VLOOKUP($M19,$A$19:$J$22,10)","v":0},{"$f":"VLOOKUP($M19,$A$19:$F$22,4)","v":0},{"$f":"VLOOKUP($M19,$A$19:$F$22,5)","v":0},{"$f":"VLOOKUP($M19,$A$19:$F$22,6)","v":0}]
[null,"2014-06-13","13:00:00","Natal",null,"México",null,null,"x",null,"Camarões",null,{"$f":"IF(OR(H11=\"\",J11=\"\"),\"\",IF(H11=J11,1,IF(H11>J11,3,0)))","v":""},{"$f":"IF(OR(J11=\"\",H11=\"\"),\"\",IF(J11=H11,1,IF(J11>H11,3,0)))","v":""},"2°",{"$f":"VLOOKUP(M20,A$19:F$22,2)","v":"Camarões"},null,{"$f":"VLOOKUP(M20,A$19:F$22,3)","v":0},{"$f":"VLOOKUP($M20,A$19:J$22,8)","v":0},{"$f":"VLOOKUP($M20,$A$19:$J$22,9)","v":0},{"$f":"VLOOKUP($M20,$A$19:$J$22,10)","v":0},{"$f":"VLOOKUP($M20,$A$19:$F$22,4)","v":0},{"$f":"VLOOKUP($M20,$A$19:$F$22,5)","v":0},{"$f":"VLOOKUP($M20,$A$19:$F$22,6)","v":0}]
[null,"2014-06-17","16:00:00","Fortaleza",null,{"$f":"F10","v":"Brasil"},null,null,"x",null,{"$f":"F11","v":"México"},null,"","","3°","México",null,{"$f":"VLOOKUP(M21,A$19:F$22,3)","v":0},0,0,0,0,0,0]
[null,"2014-06-18","19:00:00","Manaus",null,{"$f":"K11","v":"Camarões"},null,null,"x",null,{"$f":"K10","v":"Croácia"},null,"","","4°","Brasil",null,{"$f":"VLOOKUP(M22,A$19:F$22,3)","v":0},0,0,0,0,0,0]
[null,"2014-06-23","17:00:00","Brasília",null,{"$f":"K11","v":"Camarões"},null,null,"x",null,{"$f":"F10","v":"Brasil"},null,"",""]
[null,"2014-06-23","17:00:00","Recife",null,{"$f":"K10","v":"Croácia"},null,null,"x",null,{"$f":"F11","v":"México"},null,"",""]
[]
[null,null,null,null,null,null,null,null,null,null,null,null,null,null,null,null,null,"V-E","V-D","E-E","E-D","D-E","D-D"]
[null,null,"pts","gp","gc","sg","calc","v","e","d","maior",null,"corresp",null,null,null,{"$f":"F10","v":"Brasil"},{"$f":"IF(H10>J10,1,)","v":0},{"$f":"IF(J10>H10,1,)","v":0},{"$f":"IF(OR($H10=\"\",$J10=\"\"),\"\",IF($H10=$J10,1,))","v":""},{"$f":"IF(OR($H10=\"\",$J10=\"\"),\"\",IF($H10=$J10,1,))","v":""},{"$f":"IF(H10<J10,1,)","v":0},{"$f":"IF(J10<H10,1,)","v":0},{"$f":"K10","v":"Croácia"}]
[1,{"$f":"F10","v":"Brasil"},{"$f":"SUM(M10,M12,N14)","v":0},{"$f":"SUM(H10,H12,J14)","v":0},{"$f":"SUM(J10,J12,H14)","v":0},{"$f":"D19-E19","v":0},{"$f":"(C19*10^10)+((F19+50)*10^6)+(D19*10)+A19","v":50000001},{"$f":"SUM(R18,R20,S22)","v":0},{"$f":"SUM(T18,T20,U22)","v":0},{"$f":"SUM(V18,V20,W22)","v":0},{"$f":"LARGE(G19:J22,A19)","v":50000004},null,{"$f":"MATCH(K19,G$19:G$22,0)","v":4},null,null,null,"México",0,0,{"$f":"IF(OR(H11=\"\",J11=\"\"),\"\",IF($H11=$J11,1,))","v":""},{"$f":"IF(OR($H11=\"\",$J11=\"\"),\"\",IF($H11=$J11,1,))","v":""},0,0,{"$f":"K11","v":"Camarões"}]
[2,{"$f":"F11","v":"México"},{"$f":"SUM(M11,N12,N15)","v":0},{"$f":"SUM(H11,J12,J15)","v":0},{"$f":"SUM(J11,H12,H15)","v":0},{"$f":"D20-E20","v":0},{"$f":"(C20*10^10)+((F20+50)*10^6)+(D20*10)+A20","v":50000002},{"$f":"SUM(R19,S20,S23)","v":0},{"$f":"SUM(T19,U20,U23)","v":0},{"$f":"SUM(V19,W20,W23)","v":0},{"$f":"LARGE(G$19:J$22,A20)","v":50000003},null,{"$f":"MATCH(K20,G$19:G$22,0)","v":3},null,null,null,"Brasil",0,0,"","",0,0,"México"]
[3,{"$f":"K11","v":"Camarões"},{"$f":"SUM(N11,M13,M14)","v":0},{"$f":"SUM(J11,H13,H14)","v":0},{"$f":"SUM(H11,J13,J14)","v":0},0,50000003,{"$f":"SUM(S19,R21,R22)","v":0},{"$f":"SUM(U19,T21,T22)","v":0},{"$f":"SUM(W19,V21,V22)","v":0},50000002,null,2,null,null,null,"Camarões",0,0,"","",0,0,"Croácia"]
[4,{"$f":"K10","v":"Croácia"},{"$f":"SUM(N10,N13,M15)","v":0},{"$f":"SUM(J10,J13,H15)","v":0},{"$f":"SUM(H10,H13,J15)","v":0},0,50000004,{"$f":"SUM(S18,S21,R23)","v":0},{"$f":"SUM(U18,U21,T23)","v":0},{"$f":"SUM(W18,W21,V23)","v":0},50000001,null,1,null,null,null,"Camarões",0,0,"","",0,0,"Brasil"]
[null,null,null,null,null,{"$f":"SUM(F19:F22)","v":0},null,null,null,null,null,null,null,null,null,null,"Croácia",0,0,"","",0,0,"México"]

{"sheet":"Grupo B","index":2,"n_rows":23,"n_cols":24,"rows_kept":23,"cut":false,"hidden":false,"merged":[[10,3,10,4],[10,5,10,6],[10,10,10,11],[10,15,10,16],[7,1,7,11],[8,3,8,4],[8,5,8,6],[8,7,8,9],[8,10,8,11],[8,15,8,16],[9,3,9,4],[9,5,9,6],[9,10,9,11],[9,15,9,16],[11,3,11,4],[11,5,11,6],[11,10,11,11],[11,15,11,16],[12,3,12,4],[12,5,12,6],[12,10,12,11],[12,15,12,16],[13,3,13,4],[13,5,13,6],[13,10,13,11],[14,3,14,4],[14,5,14,6],[14,10,14,11]]}
[]
[]
[]
[]
[]
[]
[]
[null,"Grupo B"]
[null,"Data","Hora","Local",null,"Seleção",null,"Placar",null,null,"Seleção",null,null,null,null,"Equipe",null,"Pts","V","E","D","GP","GC","SG"]
[null,"2014-06-13","16:00:00","Salvador",null,"Espanha",null,null,"x",null,"Holanda",null,{"$f":"IF(OR(H10=\"\",J10=\"\"),\"\",IF(H10=J10,1,IF(H10>J10,3,0)))","v":""},{"$f":"IF(OR(J10=\"\",H10=\"\"),\"\",IF(J10=H10,1,IF(J10>H10,3,0)))","v":""},"1°",{"$f":"VLOOKUP(M19,A$19:F$22,2)","v":"Holanda"},null,{"$f":"VLOOKUP($M19,$A$19:$F$22,3)","v":0},{"$f":"VLOOKUP($M19,$A$19:$J$22,8)","v":0},{"$f":"VLOOKUP($M19,$A$19:$J$22,9)","v":0},{"$f":"VLOOKUP($M19,$A$19:$J$22,10)","v":0},{"$f":"VLOOKUP($M19,$A$19:$F$22,4)","v":0},{"$f":"VLOOKUP($M19,$A$19:$F$22,5)","v":0},{"$f":"VLOOKUP($M19,$A$19:$F$22,6)","v":0}]
[null,"2014-06-13","19:00:00","Cuiabá",null,"Chile",null,null,"x",null,"Austrália",null,{"$f":"IF(OR(H11=\"\",J11=\"\"),\"\",IF(H11=J11,1,IF(H11>J11,3,0)))","v":""},{"$f":"IF(OR(J11=\"\",H11=\"\"),\"\",IF(J11=H11,1,IF(J11>H11,3,0)))","v":""},"2°",{"$f":"VLOOKUP(M20,A$19:F$22,2)","v":"Austrália"},null,{"$f":"VLOOKUP(M20,A$19:F$22,3)","v":0},{"$f":"VLOOKUP($M20,A$19:J$22,8)","v":0},{"$f":"VLOOKUP($M20,$A$19:$J$22,9)","v":0},{"$f":"VLOOKUP($M20,$A$19:$J$22,10)","v":0},{"$f":"VLOOKUP($M20,$A$19:$F$22,4)","v":0},{"$f":"VLOOKUP($M20,$A$19:$F$22,5)","v":0},{"$f":"VLOOKUP($M20,$A$19:$F$22,6)","v":0}]
[null,"2014-06-18","16:00:00","Rio de Janeiro",null,{"$f":"F10","v":"Espanha"},null,null,"x",null,{"$f":"F11","v":"Chile"},null,"","","3°",{"$f":"VLOOKUP(M21,A$19:F$22,2)","v":"Chile"},null,{"$f":"VLOOKUP(M21,A$19:F$22,3)","v":0},0,0,0,0,0,0]
[null,"2014-06-18","13:00:00","Porto Alegre",null,{"$f":"K11","v":"Austrália"},null,null,"x",null,{"$f":"K10","v":"Holanda"},null,"","","4°",{"$f":"VLOOKUP(M22,A$19:F$22,2)","v":"Espanha"},null,{"$f":"VLOOKUP(M22,A$19:F$22,3)","v":0},0,0,0,0,0,0]
[null,"2014-06-23","13:00:00","Curitiba",null,{"$f":"K11","v":"Austrália"},null,null,"x",null,{"$f":"F10","v":"Espanha"},null,"",""]
[null,"2014-06-23","13:00:00","São Paulo",null,{"$f":"K10","v":"Holanda"},null,null,"x",null,{"$f":"F11","v":"Chile"},null,"",""]
[]
[null,null,null,null,null,null,null,null,null,null,null,null,null,null,null,null,null,"V-E","V-D","E-E","E-D","D-E","D-D"]
[null,null,"pts","gp","gc","sg","calc","v","e","d","maior",null,"corresp",null,null,null,{"$f":"F10","v":"Espanha"},{"$f":"IF(H10>J10,1,)","v":0},{"$f":"IF(J10>H10,1,)","v":0},{"$f":"IF(OR($H10=\"\",$J10=\"\"),\"\",IF($H10=$J10,1,))","v":""},{"$f":"IF(OR($H10=\"\",$J10=\"\"),\"\",IF($H10=$J10,1,))","v":""},{"$f":"IF(H10<J10,1,)","v":0},{"$f":"IF(J10<H10,1,)","v":0},{"$f":"K10","v":"Holanda"}]
[1,{"$f":"F10","v":"Espanha"},{"$f":"SUM(M10,M12,N14)","v":0},{"$f":"SUM(H10,H12,J14)","v":0},{"$f":"SUM(J10,J12,H14)","v":0},{"$f":"D19-E19","v":0},{"$f":"(C19*10^10)+((F19+50)*10^6)+(D19*10)+A19","v":50000001},{"$f":"SUM(R18,R20,S22)","v":0},{"$f":"SUM(T18,T20,U22)","v":0},{"$f":"SUM(V18,V20,W22)","v":0},{"$f":"LARGE(G19:J22,A19)","v":50000004},null,{"$f":"MATCH(K19,G$19:G$22,0)","v":4},null,null,null,"Chile",0,0,{"$f":"IF(OR(H11=\"\",J11=\"\"),\"\",IF($H11=$J11,1,))","v":""},{"$f":"IF(OR($H11=\"\",$J11=\"\"),\"\",IF($H11=$J11,1,))","v":""},0,0,{"$f":"K11","v":"Austrália"}]
[2,{"$f":"F11","v":"Chile"},{"$f":"SUM(M11,N12,N15)","v":0},{"$f":"SUM(H11,J12,J15)","v":0},{"$f":"SUM(J11,H12,H15)","v":0},{"$f":"D20-E20","v":0},{"$f":"(C20*10^10)+((F20+50)*10^6)+(D20*10)+A20","v":50000002},{"$f":"SUM(R19,S20,S23)","v":0},{"$f":"SUM(T19,U20,U23)","v":0},{"$f":"SUM(V19,W20,W23)","v":0},{"$f":"LARGE(G$19:J$22,A20)","v":50000003},null,{"$f":"MATCH(K20,G$19:G$22,0)","v":3},null,null,null,"Espanha",0,0,"","",0,0,"Chile"]
[3,{"$f":"K11","v":"Austrália"},{"$f":"SUM(N11,M13,M14)","v":0},{"$f":"SUM(J11,H13,H14)","v":0},{"$f":"SUM(H11,J13,J14)","v":0},0,50000003,{"$f":"SUM(S19,R21,R22)","v":0},{"$f":"SUM(U19,T21,T22)","v":0},{"$f":"SUM(W19,V21,V22)","v":0},50000002,null,2,null,null,null,"Austrália",0,0,"","",0,0,"Holanda"]
[4,{"$f":"K10","v":"Holanda"},{"$f":"SUM(N10,N13,M15)","v":0},{"$f":"SUM(J10,J13,H15)","v":0},{"$f":"SUM(H10,H13,J15)","v":0},0,50000004,{"$f":"SUM(S18,S21,R23)","v":0},{"$f":"SUM(U18,U21,T23)","v":0},{"$f":"SUM(W18,W21,V23)","v":0},50000001,null,1,null,null,null,"Austrália",0,0,"","",0,0,"Espanha"]
[null,null,null,null,null,{"$f":"SUM(F19:F22)","v":0},null,null,null,null,null,null,null,null,null,null,"Holanda",0,0,"","",0,0,"Chile"]

{"sheet":"Grupo C","index":3,"n_rows":23,"n_cols":24,"rows_kept":23,"cut":false,"hidden":false,"merged":[[13,3,13,4],[13,5,13,6],[13,10,13,11],[14,3,14,4],[14,5,14,6],[14,10,14,11],[11,3,11,4],[11,5,11,6],[11,10,11,11],[11,15,11,16],[12,3,12,4],[12,5,12,6],[12,10,12,11],[12,15,12,16],[9,3,9,4],[9,5,9,6],[9,10,9,11],[9,15,9,16],[10,3,10,4],[10,5,10,6],[10,10,10,11],[10,15,10,16],[8,15,8,16],[7,1,7,11],[8,3,8,4],[8,5,8,6],[8,7,8,9],[8,10,8,11]]}
[]
[]
[]
[]
[]
[]
[]
[null,"Grupo C"]
[null,"Data","Hora","Local",null,"Seleção",null,"Placar",null,null,"Seleção",null,null,null,null,"Equipe",null,"Pts","V","E","D","GP","GC","SG"]
[null,"2014-06-14","13:00:00","Belo Horizonte",null,"Colômbia",null,null,"x",null,"Grécia",null,{"$f":"IF(OR(H10=\"\",J10=\"\"),\"\",IF(H10=J10,1,IF(H10>J10,3,0)))","v":""},{"$f":"IF(OR(J10=\"\",H10=\"\"),\"\",IF(J10=H10,1,IF(J10>H10,3,0)))","v":""},"1°",{"$f":"VLOOKUP(M19,A$19:F$22,2)","v":"Grécia"},null,{"$f":"VLOOKUP($M19,$A$19:$F$22,3)","v":0},{"$f":"VLOOKUP($M19,$A$19:$J$22,8)","v":0},{"$f":"VLOOKUP($M19,$A$19:$J$22,9)","v":0},{"$f":"VLOOKUP($M19,$A$19:$J$22,10)","v":0},{"$f":"VLOOKUP($M19,$A$19:$F$22,4)","v":0},{"$f":"VLOOKUP($M19,$A$19:$F$22,5)","v":0},{"$f":"VLOOKUP($M19,$A$19:$F$22,6)","v":0}]
[null,"2014-06-14","22:00:00","Recife",null,"Costa do Marfim",null,null,"x",null,"Japão",null,{"$f":"IF(OR(H11=\"\",J11=\"\"),\"\",IF(H11=J11,1,IF(H11>J11,3,0)))","v":""},{"$f":"IF(OR(J11=\"\",H11=\"\"),\"\",IF(J11=H11,1,IF(J11>H11,3,0)))","v":""},"2°",{"$f":"VLOOKUP(M20,A$19:F$22,2)","v":"Japão"},null,{"$f":"VLOOKUP(M20,A$19:F$22,3)","v":0},{"$f":"VLOOKUP($M20,A$19:J$22,8)","v":0},{"$f":"VLOOKUP($M20,$A$19:$J$22,9)","v":0},{"$f":"VLOOKUP($M20,$A$19:$J$22,10)","v":0},{"$f":"VLOOKUP($M20,$A$19:$F$22,4)","v":0},{"$f":"VLOOKUP($M20,$A$19:$F$22,5)","v":0},{"$f":"VLOOKUP($M20,$A$19:$F$22,6)","v":0}]
[null,"2014-06-19","13:00:00","Brasília",null,{"$f":"F10","v":"Colômbia"},null,null,"x",null,{"$f":"F11","v":"Costa do Marfim"},null,"","","3°",{"$f":"VLOOKUP(M21,A$19:F$22,2)","v":"Costa do Marfim"},null,{"$f":"VLOOKUP(M21,A$19:F$22,3)","v":0},0,0,0,0,0,0]
[null,"2014-06-19","19:00:00","Natal",null,{"$f":"K11","v":"Japão"},null,null,"x",null,{"$f":"K10","v":"Grécia"},null,"","","4°",{"$f":"VLOOKUP(M22,A$19:F$22,2)","v":"Colômbia"},null,{"$f":"VLOOKUP(M22,A$19:F$22,3)","v":0},0,0,0,0,0,0]
[null,"2014-06-24","17:00:00","Cuiabá",null,{"$f":"K11","v":"Japão"},null,null,"x",null,{"$f":"F10","v":"Colômbia"},null,"",""]
[null,"2014-06-24","17:00:00","Fortaleza",null,{"$f":"K10","v":"Grécia"},null,null,"x",null,{"$f":"F11","v":"Costa do Marfim"},null,"",""]
[]
[null,null,null,null,null,null,null,null,null,null,null,null,null,null,null,null,null,"V-E","V-D","E-E","E-D","D-E","D-D"]
[null,null,"pts","gp","gc","sg","calc","v","e","d","maior",null,"corresp",null,null,null,{"$f":"F10","v":"Colômbia"},{"$f":"IF(H10>J10,1,)","v":0},{"$f":"IF(J10>H10,1,)","v":0},{"$f":"IF(OR($H10=\"\",$J10=\"\"),\"\",IF($H10=$J10,1,))","v":""},{"$f":"IF(OR($H10=\"\",$J10=\"\"),\"\",IF($H10=$J10,1,))","v":""},{"$f":"IF(H10<J10,1,)","v":0},{"$f":"IF(J10<H10,1,)","v":0},{"$f":"K10","v":"Grécia"}]
[1,{"$f":"F10","v":"Colômbia"},{"$f":"SUM(M10,M12,N14)","v":0},{"$f":"SUM(H10,H12,J14)","v":0},{"$f":"SUM(J10,J12,H14)","v":0},{"$f":"D19-E19","v":0},{"$f":"(C19*10^10)+((F19+50)*10^6)+(D19*10)+A19","v":50000001},{"$f":"SUM(R18,R20,S22)","v":0},{"$f":"SUM(T18,T20,U22)","v":0},{"$f":"SUM(V18,V20,W22)","v":0},{"$f":"LARGE(G19:J22,A19)","v":50000004},null,{"$f":"MATCH(K19,G$19:G$22,0)","v":4},null,null,null,"Costa do Marfim",0,0,{"$f":"IF(OR(H11=\"\",J11=\"\"),\"\",IF($H11=$J11,1,))","v":""},{"$f":"IF(OR($H11=\"\",$J11=\"\"),\"\",IF($H11=$J11,1,))","v":""},0,0,{"$f":"K11","v":"Japão"}]
[2,{"$f":"F11","v":"Costa do Marfim"},{"$f":"SUM(M11,N12,N15)","v":0},{"$f":"SUM(H11,J12,J15)","v":0},{"$f":"SUM(J11,H12,H15)","v":0},{"$f":"D20-E20","v":0},{"$f":"(C20*10^10)+((F20+50)*10^6)+(D20*10)+A20","v":50000002},{"$f":"SUM(R19,S20,S23)","v":0},{"$f":"SUM(T19,U20,U23)","v":0},{"$f":"SUM(V19,W20,W23)","v":0},{"$f":"LARGE(G$19:J$22,A20)","v":50000003},null,{"$f":"MATCH(K20,G$19:G$22,0)","v":3},null,null,null,"Colômbia",0,0,"","",0,0,"Costa do Marfim"]
[3,{"$f":"K11","v":"Japão"},{"$f":"SUM(N11,M13,M14)","v":0},{"$f":"SUM(J11,H13,H14)","v":0},{"$f":"SUM(H11,J13,J14)","v":0},0,50000003,{"$f":"SUM(S19,R21,R22)","v":0},{"$f":"SUM(U19,T21,T22)","v":0},{"$f":"SUM(W19,V21,V22)","v":0},50000002,null,2,null,null,null,"Japão",0,0,"","",0,0,"Grécia"]
[4,{"$f":"K10","v":"Grécia"},{"$f":"SUM(N10,N13,M15)","v":0},{"$f":"SUM(J10,J13,H15)","v":0},{"$f":"SUM(H10,H13,J15)","v":0},0,50000004,{"$f":"SUM(S18,S21,R23)","v":0},{"$f":"SUM(U18,U21,T23)","v":0},{"$f":"SUM(W18,W21,V23)","v":0},50000001,null,1,null,null,null,"Japão",0,0,"","",0,0,"Colômbia"]
[null,null,null,null,null,{"$f":"SUM(F19:F22)","v":0},null,null,null,null,null,null,null,null,null,null,"Grécia",0,0,"","",0,0,"Costa do Marfim"]

{"sheet":"Grupo D","index":4,"n_rows":23,"n_cols":24,"rows_kept":23,"cut":false,"hidden":false,"merged":[[13,3,13,4],[13,5,13,6],[13,10,13,11],[14,3,14,4],[14,5,14,6],[14,10,14,11],[11,3,11,4],[11,5,11,6],[11,10,11,11],[11,15,11,16],[12,3,12,4],[12,5,12,6],[12,10,12,11],[12,15,12,16],[9,3,9,4],[9,5,9,6],[9,10,9,11],[9,15,9,16],[10,3,10,4],[10,5,10,6],[10,10,10,11],[10,15,10,16],[8,15,8,16],[7,1,7,11],[8,3,8,4],[8,5,8,6],[8,7,8,9],[8,10,8,11]]}
[]
[]
[]
[]
[]
[]
[]
[null,"Grupo D"]
[null,"Data","Hora","Local",null,"Seleção",null,"Placar",null,null,"Seleção",null,null,null,null,"Equipe",null,"Pts","V","E","D","GP","GC","SG"]
[null,"2014-06-14","16:00:00","Fortaleza",null,"Uruguai",null,null,"x",null,"Costa Rica",null,{"$f":"IF(OR(H10=\"\",J10=\"\"),\"\",IF(H10=J10,1,IF(H10>J10,3,0)))","v":""},{"$f":"IF(OR(J10=\"\",H10=\"\"),\"\",IF(J10=H10,1,IF(J10>H10,3,0)))","v":""},"1°",{"$f":"VLOOKUP(M19,A$19:F$22,2)","v":"Costa Rica"},null,{"$f":"VLOOKUP($M19,$A$19:$F$22,3)","v":0},{"$f":"VLOOKUP($M19,$A$19:$J$22,8)","v":0},{"$f":"VLOOKUP($M19,$A$19:$J$22,9)","v":0},{"$f":"VLOOKUP($M19,$A$19:$J$22,10)","v":0},{"$f":"VLOOKUP($M19,$A$19:$F$22,4)","v":0},{"$f":"VLOOKUP($M19,$A$19:$F$22,5)","v":0},{"$f":"VLOOKUP($M19,$A$19:$F$22,6)","v":0}]
[null,"2014-06-14","19:00:00","Manaus",null,"Inglaterra",null,null,"x",null,"Itália",null,{"$f":"IF(OR(H11=\"\",J11=\"\"),\"\",IF(H11=J11,1,IF(H11>J11,3,0)))","v":""},{"$f":"IF(OR(J11=\"\",H11=\"\"),\"\",IF(J11=H11,1,IF(J11>H11,3,0)))","v":""},"2°",{"$f":"VLOOKUP(M20,A$19:F$22,2)","v":"Itália"},null,{"$f":"VLOOKUP(M20,A$19:F$22,3)","v":0},{"$f":"VLOOKUP($M20,A$19:J$22,8)","v":0},{"$f":"VLOOKUP($M20,$A$19:$J$22,9)","v":0},{"$f":"VLOOKUP($M20,$A$19:$J$22,10)","v":0},{"$f":"VLOOKUP($M20,$A$19:$F$22,4)","v":0},{"$f":"VLOOKUP($M20,$A$19:$F$22,5)","v":0},{"$f":"VLOOKUP($M20,$A$19:$F$22,6)","v":0}]
[null,"2014-06-19","16:00:00","São Paulo",null,{"$f":"F10","v":"Uruguai"},null,null,"x",null,{"$f":"F11","v":"Inglaterra"},null,"","","3°",{"$f":"VLOOKUP(M21,A$19:F$22,2)","v":"Inglaterra"},null,{"$f":"VLOOKUP(M21,A$19:F$22,3)","v":0},0,0,0,0,0,0]
[null,"2014-06-20","13:00:00","Recife",null,{"$f":"K11","v":"Itália"},null,null,"x",null,{"$f":"K10","v":"Costa Rica"},null,"","","4°",{"$f":"VLOOKUP(M22,A$19:F$22,2)","v":"Uruguai"},null,{"$f":"VLOOKUP(M22,A$19:F$22,3)","v":0},0,0,0,0,0,0]
[null,"2014-06-24","13:00:00","Natal",null,{"$f":"K11","v":"Itália"},null,null,"x",null,{"$f":"F10","v":"Uruguai"},null,"",""]
[null,"2014-06-24","13:00:00","Belo Horizonte",null,{"$f":"K10","v":"Costa Rica"},null,null,"x",null,{"$f":"F11","v":"Inglaterra"},null,"",""]
[]
[null,null,null,null,null,null,null,null,null,null,null,null,null,null,null,null,null,"V-E","V-D","E-E","E-D","D-E","D-D"]
[null,null,"pts","gp","gc","sg","calc","v","e","d","maior",null,"corresp",null,null,null,{"$f":"F10","v":"Uruguai"},{"$f":"IF(H10>J10,1,)","v":0},{"$f":"IF(J10>H10,1,)","v":0},{"$f":"IF(OR($H10=\"\",$J10=\"\"),\"\",IF($H10=$J10,1,))","v":""},{"$f":"IF(OR($H10=\"\",$J10=\"\"),\"\",IF($H10=$J10,1,))","v":""},{"$f":"IF(H10<J10,1,)","v":0},{"$f":"IF(J10<H10,1,)","v":0},{"$f":"K10","v":"Costa Rica"}]
[1,{"$f":"F10","v":"Uruguai"},{"$f":"SUM(M10,M12,N14)","v":0},{"$f":"SUM(H10,H12,J14)","v":0},{"$f":"SUM(J10,J12,H14)","v":0},{"$f":"D19-E19","v":0},{"$f":"(C19*10^10)+((F19+50)*10^6)+(D19*10)+A19","v":50000001},{"$f":"SUM(R18,R20,S22)","v":0},{"$f":"SUM(T18,T20,U22)","v":0},{"$f":"SUM(V18,V20,W22)","v":0},{"$f":"LARGE(G19:J22,A19)","v":50000004},null,{"$f":"MATCH(K19,G$19:G$22,0)","v":4},null,null,null,"Inglaterra",0,0,{"$f":"IF(OR(H11=\"\",J11=\"\"),\"\",IF($H11=$J11,1,))","v":""},{"$f":"IF(OR($H11=\"\",$J11=\"\"),\"\",IF($H11=$J11,1,))","v":""},0,0,{"$f":"K11","v":"Itália"}]
[2,{"$f":"F11","v":"Inglaterra"},{"$f":"SUM(M11,N12,N15)","v":0},{"$f":"SUM(H11,J12,J15)","v":0},{"$f":"SUM(J11,H12,H15)","v":0},{"$f":"D20-E20","v":0},{"$f":"(C20*10^10)+((F20+50)*10^6)+(D20*10)+A20","v":50000002},{"$f":"SUM(R19,S20,S23)","v":0},{"$f":"SUM(T19,U20,U23)","v":0},{"$f":"SUM(V19,W20,W23)","v":0},{"$f":"LARGE(G$19:J$22,A20)","v":50000003},null,{"$f":"MATCH(K20,G$19:G$22,0)","v":3},null,null,null,"Uruguai",0,0,"","",0,0,"Inglaterra"]
[3,{"$f":"K11","v":"Itália"},{"$f":"SUM(N11,M13,M14)","v":0},{"$f":"SUM(J11,H13,H14)","v":0},{"$f":"SUM(H11,J13,J14)","v":0},0,50000003,{"$f":"SUM(S19,R21,R22)","v":0},{"$f":"SUM(U19,T21,T22)","v":0},{"$f":"SUM(W19,V21,V22)","v":0},50000002,null,2,null,null,null,"Itália",0,0,"","",0,0,"Costa Rica"]
[4,{"$f":"K10","v":"Costa Rica"},{"$f":"SUM(N10,N13,M15)","v":0},{"$f":"SUM(J10,J13,H15)","v":0},{"$f":"SUM(H10,H13,J15)","v":0},0,50000004,{"$f":"SUM(S18,S21,R23)","v":0},{"$f":"SUM(U18,U21,T23)","v":0},{"$f":"SUM(W18,W21,V23)","v":0},50000001,null,1,null,null,null,"Itália",0,0,"","",0,0,"Uruguai"]
[null,null,null,null,null,{"$f":"SUM(F19:F22)","v":0},null,null,null,null,null,null,null,null,null,null,"Costa Rica",0,0,"","",0,0,"Inglaterra"]

{"sheet":"Grupo E","index":5,"n_rows":23,"n_cols":24,"rows_kept":23,"cut":false,"hidden":false,"merged":[[13,3,13,4],[13,5,13,6],[13,10,13,11],[14,3,14,4],[14,5,14,6],[14,10,14,11],[11,3,11,4],[11,5,11,6],[11,10,11,11],[11,15,11,16],[12,3,12,4],[12,5,12,6],[12,10,12,11],[12,15,12,16],[9,3,9,4],[9,5,9,6],[9,10,9,11],[9,15,9,16],[10,3,10,4],[10,5,10,6],[10,10,10,11],[10,15,10,16],[8,15,8,16],[7,1,7,11],[8,3,8,4],[8,5,8,6],[8,7,8,9],[8,10,8,11]]}
[]
[]
[]
[]
[]
[]
[]
[null,"Grupo E"]
[null,"Data","Hora","Local",null,"Seleção",null,"Placar",null,null,"Seleção",null,null,null,null,"Equipe",null,"Pts","V","E","D","GP","GC","SG"]
[null,"2014-06-15","13:00:00","Brasília",null,"Suíça",null,null,"x",null,"Equador",null,{"$f":"IF(OR(H10=\"\",J10=\"\"),\"\",IF(H10=J10,1,IF(H10>J10,3,0)))","v":""},{"$f":"IF(OR(J10=\"\",H10=\"\"),\"\",IF(J10=H10,1,IF(J10>H10,3,0)))","v":""},"1°",{"$f":"VLOOKUP(M19,A$19:F$22,2)","v":"Equador"},null,{"$f":"VLOOKUP($M19,$A$19:$F$22,3)","v":0},{"$f":"VLOOKUP($M19,$A$19:$J$22,8)","v":0},{"$f":"VLOOKUP($M19,$A$19:$J$22,9)","v":0},{"$f":"VLOOKUP($M19,$A$19:$J$22,10)","v":0},{"$f":"VLOOKUP($M19,$A$19:$F$22,4)","v":0},{"$f":"VLOOKUP($M19,$A$19:$F$22,5)","v":0},{"$f":"VLOOKUP($M19,$A$19:$F$22,6)","v":0}]
[null,"2014-06-15","16:00:00","Porto Alegre",null,"França",null,null,"x",null,"Honduras",null,{"$f":"IF(OR(H11=\"\",J11=\"\"),\"\",IF(H11=J11,1,IF(H11>J11,3,0)))","v":""},{"$f":"IF(OR(J11=\"\",H11=\"\"),\"\",IF(J11=H11,1,IF(J11>H11,3,0)))","v":""},"2°",{"$f":"VLOOKUP(M20,A$19:F$22,2)","v":"Honduras"},null,{"$f":"VLOOKUP(M20,A$19:F$22,3)","v":0},{"$f":"VLOOKUP($M20,A$19:J$22,8)","v":0},{"$f":"VLOOKUP($M20,$A$19:$J$22,9)","v":0},{"$f":"VLOOKUP($M20,$A$19:$J$22,10)","v":0},{"$f":"VLOOKUP($M20,$A$19:$F$22,4)","v":0},{"$f":"VLOOKUP($M20,$A$19:$F$22,5)","v":0},{"$f":"VLOOKUP($M20,$A$19:$F$22,6)","v":0}]
[null,"2014-06-20","16:00:00","Salvador",null,{"$f":"F10","v":"Suíça"},null,null,"x",null,{"$f":"F11","v":"França"},null,"","","3°",{"$f":"VLOOKUP(M21,A$19:F$22,2)","v":"França"},null,{"$f":"VLOOKUP(M21,A$19:F$22,3)","v":0},0,0,0,0,0,0]
[null,"2014-06-20","19:00:00","Curitiba",null,{"$f":"K11","v":"Honduras"},null,null,"x",null,{"$f":"K10","v":"Equador"},null,"","","4°",{"$f":"VLOOKUP(M22,A$19:F$22,2)","v":"Suíça"},null,{"$f":"VLOOKUP(M22,A$19:F$22,3)","v":0},0,0,0,0,0,0]
[null,"2014-06-25","17:00:00","Manaus",null,{"$f":"K11","v":"Honduras"},null,null,"x",null,{"$f":"F10","v":"Suíça"},null,"",""]
[null,"25//06","17:00:00","Rio de Janeiro",null,{"$f":"K10","v":"Equador"},null,null,"x",null,{"$f":"F11","v":"França"},null,"",""]
[]
[null,null,null,null,null,null,null,null,null,null,null,null,null,null,null,null,null,"V-E","V-D","E-E","E-D","D-E","D-D"]
[null,null,"pts","gp","gc","sg","calc","v","e","d","maior",null,"corresp",null,null,null,{"$f":"F10","v":"Suíça"},{"$f":"IF(H10>J10,1,)","v":0},{"$f":"IF(J10>H10,1,)","v":0},{"$f":"IF(OR($H10=\"\",$J10=\"\"),\"\",IF($H10=$J10,1,))","v":""},{"$f":"IF(OR($H10=\"\",$J10=\"\"),\"\",IF($H10=$J10,1,))","v":""},{"$f":"IF(H10<J10,1,)","v":0},{"$f":"IF(J10<H10,1,)","v":0},{"$f":"K10","v":"Equador"}]
[1,{"$f":"F10","v":"Suíça"},{"$f":"SUM(M10,M12,N14)","v":0},{"$f":"SUM(H10,H12,J14)","v":0},{"$f":"SUM(J10,J12,H14)","v":0},{"$f":"D19-E19","v":0},{"$f":"(C19*10^10)+((F19+50)*10^6)+(D19*10)+A19","v":50000001},{"$f":"SUM(R18,R20,S22)","v":0},{"$f":"SUM(T18,T20,U22)","v":0},{"$f":"SUM(V18,V20,W22)","v":0},{"$f":"LARGE(G19:J22,A19)","v":50000004},null,{"$f":"MATCH(K19,G$19:G$22,0)","v":4},null,null,null,"França",0,0,{"$f":"IF(OR(H11=\"\",J11=\"\"),\"\",IF($H11=$J11,1,))","v":""},{"$f":"IF(OR($H11=\"\",$J11=\"\"),\"\",IF($H11=$J11,1,))","v":""},0,0,{"$f":"K11","v":"Honduras"}]
[2,{"$f":"F11","v":"França"},{"$f":"SUM(M11,N12,N15)","v":0},{"$f":"SUM(H11,J12,J15)","v":0},{"$f":"SUM(J11,H12,H15)","v":0},{"$f":"D20-E20","v":0},{"$f":"(C20*10^10)+((F20+50)*10^6)+(D20*10)+A20","v":50000002},{"$f":"SUM(R19,S20,S23)","v":0},{"$f":"SUM(T19,U20,U23)","v":0},{"$f":"SUM(V19,W20,W23)","v":0},{"$f":"LARGE(G$19:J$22,A20)","v":50000003},null,{"$f":"MATCH(K20,G$19:G$22,0)","v":3},null,null,null,"Suíça",0,0,"","",0,0,"França"]
[3,{"$f":"K11","v":"Honduras"},{"$f":"SUM(N11,M13,M14)","v":0},{"$f":"SUM(J11,H13,H14)","v":0},{"$f":"SUM(H11,J13,J14)","v":0},0,50000003,{"$f":"SUM(S19,R21,R22)","v":0},{"$f":"SUM(U19,T21,T22)","v":0},{"$f":"SUM(W19,V21,V22)","v":0},50000002,null,2,null,null,null,"Honduras",0,0,"","",0,0,"Equador"]
[4,{"$f":"K10","v":"Equador"},{"$f":"SUM(N10,N13,M15)","v":0},{"$f":"SUM(J10,J13,H15)","v":0},{"$f":"SUM(H10,H13,J15)","v":0},0,50000004,{"$f":"SUM(S18,S21,R23)","v":0},{"$f":"SUM(U18,U21,T23)","v":0},{"$f":"SUM(W18,W21,V23)","v":0},50000001,null,1,null,null,null,"Honduras",0,0,"","",0,0,"Suíça"]
[null,null,null,null,null,{"$f":"SUM(F19:F22)","v":0},null,null,null,null,null,null,null,null,null,null,"Equador",0,0,"","",0,0,"França"]

{"sheet":"Grupo F","index":6,"n_rows":23,"n_cols":24,"rows_kept":23,"cut":false,"hidden":false,"merged":[[13,3,13,4],[13,5,13,6],[13,10,13,11],[14,3,14,4],[14,5,14,6],[14,10,14,11],[11,3,11,4],[11,5,11,6],[11,10,11,11],[11,15,11,16],[12,3,12,4],[12,5,12,6],[12,10,12,11],[12,15,12,16],[9,3,9,4],[9,5,9,6],[9,10,9,11],[9,15,9,16],[10,3,10,4],[10,5,10,6],[10,10,10,11],[10,15,10,16],[8,15,8,16],[7,1,7,11],[8,3,8,4],[8,5,8,6],[8,7,8,9],[8,10,8,11]]}
[]
[]
[]
[]
[]
[]
[]
[null,"Grupo F"]
[null,"Data","Hora","Local",null,"Seleção",null,"Placar",null,null,"Seleção",null,null,null,null,"Equipe",null,"Pts","V","E","D","GP","GC","SG"]
[null,"2014-06-15","19:00:00","Rio de Janeiro",null,"Argentina",null,null,"x",null,"Bósnia",null,{"$f":"IF(OR(H10=\"\",J10=\"\"),\"\",IF(H10=J10,1,IF(H10>J10,3,0)))","v":""},{"$f":"IF(OR(J10=\"\",H10=\"\"),\"\",IF(J10=H10,1,IF(J10>H10,3,0)))","v":""},"1°",{"$f":"VLOOKUP(M19,A$19:F$22,2)","v":"Bósnia"},null,{"$f":"VLOOKUP($M19,$A$19:$F$22,3)","v":0},{"$f":"VLOOKUP($M19,$A$19:$J$22,8)","v":0},{"$f":"VLOOKUP($M19,$A$19:$J$22,9)","v":0},{"$f":"VLOOKUP($M19,$A$19:$J$22,10)","v":0},{"$f":"VLOOKUP($M19,$A$19:$F$22,4)","v":0},{"$f":"VLOOKUP($M19,$A$19:$F$22,5)","v":0},{"$f":"VLOOKUP($M19,$A$19:$F$22,6)","v":0}]
[null,"2014-06-16","16:00:00","Curitiba",null,"Irã",null,null,"x",null,"Nigéria",null,{"$f":"IF(OR(H11=\"\",J11=\"\"),\"\",IF(H11=J11,1,IF(H11>J11,3,0)))","v":""},{"$f":"IF(OR(J11=\"\",H11=\"\"),\"\",IF(J11=H11,1,IF(J11>H11,3,0)))","v":""},"2°",{"$f":"VLOOKUP(M20,A$19:F$22,2)","v":"Nigéria"},null,{"$f":"VLOOKUP(M20,A$19:F$22,3)","v":0},{"$f":"VLOOKUP($M20,A$19:J$22,8)","v":0},{"$f":"VLOOKUP($M20,$A$19:$J$22,9)","v":0},{"$f":"VLOOKUP($M20,$A$19:$J$22,10)","v":0},{"$f":"VLOOKUP($M20,$A$19:$F$22,4)","v":0},{"$f":"VLOOKUP($M20,$A$19:$F$22,5)","v":0},{"$f":"VLOOKUP($M20,$A$19:$F$22,6)","v":0}]
[null,"2014-06-21","13:00:00","Belo Horizonte",null,{"$f":"F10","v":"Argentina"},null,null,"x",null,{"$f":"F11","v":"Irã"},null,"","","3°",{"$f":"VLOOKUP(M21,A$19:F$22,2)","v":"Irã"},null,{"$f":"VLOOKUP(M21,A$19:F$22,3)","v":0},0,0,0,0,0,0]
[null,"2014-06-21","19:00:00","Cuiabá",null,{"$f":"K11","v":"Nigéria"},null,null,"x",null,{"$f":"K10","v":"Bósnia"},null,"","","4°",{"$f":"VLOOKUP(M22,A$19:F$22,2)","v":"Argentina"},null,{"$f":"VLOOKUP(M22,A$19:F$22,3)","v":0},0,0,0,0,0,0]
[null,"2014-06-25","13:00:00","Porto Alegre",null,{"$f":"K11","v":"Nigéria"},null,null,"x",null,{"$f":"F10","v":"Argentina"},null,"",""]
[null,"25//06","13:00:00","Salvador",null,{"$f":"K10","v":"Bósnia"},null,null,"x",null,{"$f":"F11","v":"Irã"},null,"",""]
[]
[null,null,null,null,null,null,null,null,null,null,null,null,null,null,null,null,null,"V-E","V-D","E-E","E-D","D-E","D-D"]
[null,null,"pts","gp","gc","sg","calc","v","e","d","maior",null,"corresp",null,null,null,{"$f":"F10","v":"Argentina"},{"$f":"IF(H10>J10,1,)","v":0},{"$f":"IF(J10>H10,1,)","v":0},{"$f":"IF(OR($H10=\"\",$J10=\"\"),\"\",IF($H10=$J10,1,))","v":""},{"$f":"IF(OR($H10=\"\",$J10=\"\"),\"\",IF($H10=$J10,1,))","v":""},{"$f":"IF(H10<J10,1,)","v":0},{"$f":"IF(J10<H10,1,)","v":0},{"$f":"K10","v":"Bósnia"}]
[1,{"$f":"F10","v":"Argentina"},{"$f":"SUM(M10,M12,N14)","v":0},{"$f":"SUM(H10,H12,J14)","v":0},{"$f":"SUM(J10,J12,H14)","v":0},{"$f":"D19-E19","v":0},{"$f":"(C19*10^10)+((F19+50)*10^6)+(D19*10)+A19","v":50000001},{"$f":"SUM(R18,R20,S22)","v":0},{"$f":"SUM(T18,T20,U22)","v":0},{"$f":"SUM(V18,V20,W22)","v":0},{"$f":"LARGE(G19:J22,A19)","v":50000004},null,{"$f":"MATCH(K19,G$19:G$22,0)","v":4},null,null,null,"Irã",0,0,{"$f":"IF(OR(H11=\"\",J11=\"\"),\"\",IF($H11=$J11,1,))","v":""},{"$f":"IF(OR($H11=\"\",$J11=\"\"),\"\",IF($H11=$J11,1,))","v":""},0,0,{"$f":"K11","v":"Nigéria"}]
[2,{"$f":"F11","v":"Irã"},{"$f":"SUM(M11,N12,N15)","v":0},{"$f":"SUM(H11,J12,J15)","v":0},{"$f":"SUM(J11,H12,H15)","v":0},{"$f":"D20-E20","v":0},{"$f":"(C20*10^10)+((F20+50)*10^6)+(D20*10)+A20","v":50000002},{"$f":"SUM(R19,S20,S23)","v":0},{"$f":"SUM(T19,U20,U23)","v":0},{"$f":"SUM(V19,W20,W23)","v":0},{"$f":"LARGE(G$19:J$22,A20)","v":50000003},null,{"$f":"MATCH(K20,G$19:G$22,0)","v":3},null,null,null,"Argentina",0,0,"","",0,0,"Irã"]
[3,{"$f":"K11","v":"Nigéria"},{"$f":"SUM(N11,M13,M14)","v":0},{"$f":"SUM(J11,H13,H14)","v":0},{"$f":"SUM(H11,J13,J14)","v":0},0,50000003,{"$f":"SUM(S19,R21,R22)","v":0},{"$f":"SUM(U19,T21,T22)","v":0},{"$f":"SUM(W19,V21,V22)","v":0},50000002,null,2,null,null,null,"Nigéria",0,0,"","",0,0,"Bósnia"]
[4,{"$f":"K10","v":"Bósnia"},{"$f":"SUM(N10,N13,M15)","v":0},{"$f":"SUM(J10,J13,H15)","v":0},{"$f":"SUM(H10,H13,J15)","v":0},0,50000004,{"$f":"SUM(S18,S21,R23)","v":0},{"$f":"SUM(U18,U21,T23)","v":0},{"$f":"SUM(W18,W21,V23)","v":0},50000001,null,1,null,null,null,"Nigéria",0,0,"","",0,0,"Argentina"]
[null,null,null,null,null,{"$f":"SUM(F19:F22)","v":0},null,null,null,null,null,null,null,null,null,null,"Bósnia",0,0,"","",0,0,"Irã"]

{"sheet":"Grupo G","index":7,"n_rows":23,"n_cols":24,"rows_kept":23,"cut":false,"hidden":false,"merged":[[13,3,13,4],[13,5,13,6],[13,10,13,11],[14,3,14,4],[14,5,14,6],[14,10,14,11],[11,3,11,4],[11,5,11,6],[11,10,11,11],[11,15,11,16],[12,3,12,4],[12,5,12,6],[12,10,12,11],[12,15,12,16],[9,3,9,4],[9,5,9,6],[9,10,9,11],[9,15,9,16],[10,3,10,4],[10,5,10,6],[10,10,10,11],[10,15,10,16],[8,15,8,16],[7,1,7,11],[8,3,8,4],[8,5,8,6],[8,7,8,9],[8,10,8,11]]}
[]
[]
[]
[]
[]
[]
[]
[null,"Grupo G"]
[null,"Data","Hora","Local",null,"Seleção",null,"Placar",null,null,"Seleção",null,null,null,null,"Equipe",null,"Pts","V","E","D","GP","GC","SG"]
[null,"2014-06-16","13:00:00","Salvador",null,"Alemanha",null,null,"x",null,"Portugal",null,{"$f":"IF(OR(H10=\"\",J10=\"\"),\"\",IF(H10=J10,1,IF(H10>J10,3,0)))","v":""},{"$f":"IF(OR(J10=\"\",H10=\"\"),\"\",IF(J10=H10,1,IF(J10>H10,3,0)))","v":""},"1°",{"$f":"VLOOKUP(M19,A$19:F$22,2)","v":"Portugal"},null,{"$f":"VLOOKUP($M19,$A$19:$F$22,3)","v":0},{"$f":"VLOOKUP($M19,$A$19:$J$22,8)","v":0},{"$f":"VLOOKUP($M19,$A$19:$J$22,9)","v":0},{"$f":"VLOOKUP($M19,$A$19:$J$22,10)","v":0},{"$f":"VLOOKUP($M19,$A$19:$F$22,4)","v":0},{"$f":"VLOOKUP($M19,$A$19:$F$22,5)","v":0},{"$f":"VLOOKUP($M19,$A$19:$F$22,6)","v":0}]
[null,"2014-06-16","19:00:00","Natal",null,"Gana",null,null,"x",null,"Estados Unidos",null,{"$f":"IF(OR(H11=\"\",J11=\"\"),\"\",IF(H11=J11,1,IF(H11>J11,3,0)))","v":""},{"$f":"IF(OR(J11=\"\",H11=\"\"),\"\",IF(J11=H11,1,IF(J11>H11,3,0)))","v":""},"2°",{"$f":"VLOOKUP(M20,A$19:F$22,2)","v":"Estados Unidos"},null,{"$f":"VLOOKUP(M20,A$19:F$22,3)","v":0},{"$f":"VLOOKUP($M20,A$19:J$22,8)","v":0},{"$f":"VLOOKUP($M20,$A$19:$J$22,9)","v":0},{"$f":"VLOOKUP($M20,$A$19:$J$22,10)","v":0},{"$f":"VLOOKUP($M20,$A$19:$F$22,4)","v":0},{"$f":"VLOOKUP($M20,$A$19:$F$22,5)","v":0},{"$f":"VLOOKUP($M20,$A$19:$F$22,6)","v":0}]
[null,"2014-06-21","16:00:00","Fortaleza",null,{"$f":"F10","v":"Alemanha"},null,null,"x",null,{"$f":"F11","v":"Gana"},null,"","","3°",{"$f":"VLOOKUP(M21,A$19:F$22,2)","v":"Gana"},null,{"$f":"VLOOKUP(M21,A$19:F$22,3)","v":0},0,0,0,0,0,0]
[null,"2014-06-22","19:00:00","Manaus",null,{"$f":"K11","v":"Estados Unidos"},null,null,"x",null,{"$f":"K10","v":"Portugal"},null,"","","4°",{"$f":"VLOOKUP(M22,A$19:F$22,2)","v":"Alemanha"},null,{"$f":"VLOOKUP(M22,A$19:F$22,3)","v":0},0,0,0,0,0,0]
[null,"2014-06-26","13:00:00","Recife",null,{"$f":"K11","v":"Estados Unidos"},null,null,"x",null,{"$f":"F10","v":"Alemanha"},null,"",""]
[null,"2014-06-26","13:00:00","Brasília",null,{"$f":"K10","v":"Portugal"},null,null,"x",null,{"$f":"F11","v":"Gana"},null,"",""]
[]
[null,null,null,null,null,null,null,null,null,null,null,null,null,null,null,null,null,"V-E","V-D","E-E","E-D","D-E","D-D"]
[null,null,"pts","gp","gc","sg","calc","v","e","d","maior",null,"corresp",null,null,null,{"$f":"F10","v":"Alemanha"},{"$f":"IF(H10>J10,1,)","v":0},{"$f":"IF(J10>H10,1,)","v":0},{"$f":"IF(OR($H10=\"\",$J10=\"\"),\"\",IF($H10=$J10,1,))","v":""},{"$f":"IF(OR($H10=\"\",$J10=\"\"),\"\",IF($H10=$J10,1,))","v":""},{"$f":"IF(H10<J10,1,)","v":0},{"$f":"IF(J10<H10,1,)","v":0},{"$f":"K10","v":"Portugal"}]
[1,{"$f":"F10","v":"Alemanha"},{"$f":"SUM(M10,M12,N14)","v":0},{"$f":"SUM(H10,H12,J14)","v":0},{"$f":"SUM(J10,J12,H14)","v":0},{"$f":"D19-E19","v":0},{"$f":"(C19*10^10)+((F19+50)*10^6)+(D19*10)+A19","v":50000001},{"$f":"SUM(R18,R20,S22)","v":0},{"$f":"SUM(T18,T20,U22)","v":0},{"$f":"SUM(V18,V20,W22)","v":0},{"$f":"LARGE(G19:J22,A19)","v":50000004},null,{"$f":"MATCH(K19,G$19:G$22,0)","v":4},null,null,null,"Gana",0,0,{"$f":"IF(OR(H11=\"\",J11=\"\"),\"\",IF($H11=$J11,1,))","v":""},{"$f":"IF(OR($H11=\"\",$J11=\"\"),\"\",IF($H11=$J11,1,))","v":""},0,0,{"$f":"K11","v":"Estados Unidos"}]
[2,{"$f":"F11","v":"Gana"},{"$f":"SUM(M11,N12,N15)","v":0},{"$f":"SUM(H11,J12,J15)","v":0},{"$f":"SUM(J11,H12,H15)","v":0},{"$f":"D20-E20","v":0},{"$f":"(C20*10^10)+((F20+50)*10^6)+(D20*10)+A20","v":50000002},{"$f":"SUM(R19,S20,S23)","v":0},{"$f":"SUM(T19,U20,U23)","v":0},{"$f":"SUM(V19,W20,W23)","v":0},{"$f":"LARGE(G$19:J$22,A20)","v":50000003},null,{"$f":"MATCH(K20,G$19:G$22,0)","v":3},null,null,null,"Alemanha",0,0,"","",0,0,"Gana"]
[3,{"$f":"K11","v":"Estados Unidos"},{"$f":"SUM(N11,M13,M14)","v":0},{"$f":"SUM(J11,H13,H14)","v":0},{"$f":"SUM(H11,J13,J14)","v":0},0,50000003,{"$f":"SUM(S19,R21,R22)","v":0},{"$f":"SUM(U19,T21,T22)","v":0},{"$f":"SUM(W19,V21,V22)","v":0},50000002,null,2,null,null,null,"Estados Unidos",0,0,"","",0,0,"Portugal"]
[4,{"$f":"K10","v":"Portugal"},{"$f":"SUM(N10,N13,M15)","v":0},{"$f":"SUM(J10,J13,H15)","v":0},{"$f":"SUM(H10,H13,J15)","v":0},0,50000004,{"$f":"SUM(S18,S21,R23)","v":0},{"$f":"SUM(U18,U21,T23)","v":0},{"$f":"SUM(W18,W21,V23)","v":0},50000001,null,1,null,null,null,"Estados Unidos",0,0,"","",0,0,"Alemanha"]
[null,null,null,null,null,{"$f":"SUM(F19:F22)","v":0},null,null,null,null,null,null,null,null,null,null,"Portugal",0,0,"","",0,0,"Gana"]

{"sheet":"Grupo H","index":8,"n_rows":23,"n_cols":24,"rows_kept":23,"cut":false,"hidden":false,"merged":[[13,3,13,4],[13,5,13,6],[13,10,13,11],[14,3,14,4],[14,5,14,6],[14,10,14,11],[11,3,11,4],[11,5,11,6],[11,10,11,11],[11,15,11,16],[12,3,12,4],[12,5,12,6],[12,10,12,11],[12,15,12,16],[9,3,9,4],[9,5,9,6],[9,10,9,11],[9,15,9,16],[10,3,10,4],[10,5,10,6],[10,10,10,11],[10,15,10,16],[8,15,8,16],[7,1,7,11],[8,3,8,4],[8,5,8,6],[8,7,8,9],[8,10,8,11]]}
[]
[]
[]
[]
[]
[]
[]
[null,"Grupo H"]
[null,"Data","Hora","Local",null,"Seleção",null,"Placar",null,null,"Seleção",null,null,null,null,"Equipe",null,"Pts","V","E","D","GP","GC","SG"]
[null,"2014-06-17","13:00:00","Belo Horizonte",null,"Bélgica",null,null,"x",null,"Argélia",null,{"$f":"IF(OR(H10=\"\",J10=\"\"),\"\",IF(H10=J10,1,IF(H10>J10,3,0)))","v":""},{"$f":"IF(OR(J10=\"\",H10=\"\"),\"\",IF(J10=H10,1,IF(J10>H10,3,0)))","v":""},"1°",{"$f":"VLOOKUP(M19,A$19:F$22,2)","v":"Argélia"},null,{"$f":"VLOOKUP($M19,$A$19:$F$22,3)","v":0},{"$f":"VLOOKUP($M19,$A$19:$J$22,8)","v":0},{"$f":"VLOOKUP($M19,$A$19:$J$22,9)","v":0},{"$f":"VLOOKUP($M19,$A$19:$J$22,10)","v":0},{"$f":"VLOOKUP($M19,$A$19:$F$22,4)","v":0},{"$f":"VLOOKUP($M19,$A$19:$F$22,5)","v":0},{"$f":"VLOOKUP($M19,$A$19:$F$22,6)","v":0}]
[null,"2014-06-17","19:00:00","Cuiabá",null,"Rússia",null,null,"x",null,"Coreia do Sul",null,{"$f":"IF(OR(H11=\"\",J11=\"\"),\"\",IF(H11=J11,1,IF(H11>J11,3,0)))","v":""},{"$f":"IF(OR(J11=\"\",H11=\"\"),\"\",IF(J11=H11,1,IF(J11>H11,3,0)))","v":""},"2°",{"$f":"VLOOKUP(M20,A$19:F$22,2)","v":"Coreia do Sul"},null,{"$f":"VLOOKUP(M20,A$19:F$22,3)","v":0},{"$f":"VLOOKUP($M20,A$19:J$22,8)","v":0},{"$f":"VLOOKUP($M20,$A$19:$J$22,9)","v":0},{"$f":"VLOOKUP($M20,$A$19:$J$22,10)","v":0},{"$f":"VLOOKUP($M20,$A$19:$F$22,4)","v":0},{"$f":"VLOOKUP($M20,$A$19:$F$22,5)","v":0},{"$f":"VLOOKUP($M20,$A$19:$F$22,6)","v":0}]
[null,"2014-06-22","13:00:00","Rio de Janeiro",null,{"$f":"F10","v":"Bélgica"},null,null,"x",null,{"$f":"F11","v":"Rússia"},null,"","","3°",{"$f":"VLOOKUP(M21,A$19:F$22,2)","v":"Rússia"},null,{"$f":"VLOOKUP(M21,A$19:F$22,3)","v":0},0,0,0,0,0,0]
[null,"2014-06-22","16:00:00","Porto Alegre",null,{"$f":"K11","v":"Coreia do Sul"},null,null,"x",null,{"$f":"K10","v":"Argélia"},null,"","","4°",{"$f":"VLOOKUP(M22,A$19:F$22,2)","v":"Bélgica"},null,{"$f":"VLOOKUP(M22,A$19:F$22,3)","v":0},0,0,0,0,0,0]
[null,"2014-06-26","17:00:00","São Paulo",null,{"$f":"K11","v":"Coreia do Sul"},null,null,"x",null,{"$f":"F10","v":"Bélgica"},null,"",""]
[null,"2014-06-26","17:00:00","Curitiba",null,{"$f":"K10","v":"Argélia"},null,null,"x",null,{"$f":"F11","v":"Rússia"},null,"",""]
[]
[null,null,null,null,null,null,null,null,null,null,null,null,null,null,null,null,null,"V-E","V-D","E-E","E-D","D-E","D-D"]
[null,null,"pts","gp","gc","sg","calc","v","e","d","maior",null,"corresp",null,null,null,{"$f":"F10","v":"Bélgica"},{"$f":"IF(H10>J10,1,)","v":0},{"$f":"IF(J10>H10,1,)","v":0},{"$f":"IF(OR($H10=\"\",$J10=\"\"),\"\",IF($H10=$J10,1,))","v":""},{"$f":"IF(OR($H10=\"\",$J10=\"\"),\"\",IF($H10=$J10,1,))","v":""},{"$f":"IF(H10<J10,1,)","v":0},{"$f":"IF(J10<H10,1,)","v":0},{"$f":"K10","v":"Argélia"}]
[1,{"$f":"F10","v":"Bélgica"},{"$f":"SUM(M10,M12,N14)","v":0},{"$f":"SUM(H10,H12,J14)","v":0},{"$f":"SUM(J10,J12,H14)","v":0},{"$f":"D19-E19","v":0},{"$f":"(C19*10^10)+((F19+50)*10^6)+(D19*10)+A19","v":50000001},{"$f":"SUM(R18,R20,S22)","v":0},{"$f":"SUM(T18,T20,U22)","v":0},{"$f":"SUM(V18,V20,W22)","v":0},{"$f":"LARGE(G19:J22,A19)","v":50000004},null,{"$f":"MATCH(K19,G$19:G$22,0)","v":4},null,null,null,"Rússia",0,0,{"$f":"IF(OR(H11=\"\",J11=\"\"),\"\",IF($H11=$J11,1,))","v":""},{"$f":"IF(OR($H11=\"\",$J11=\"\"),\"\",IF($H11=$J11,1,))","v":""},0,0,{"$f":"K11","v":"Coreia do Sul"}]
[2,{"$f":"F11","v":"Rússia"},{"$f":"SUM(M11,N12,N15)","v":0},{"$f":"SUM(H11,J12,J15)","v":0},{"$f":"SUM(J11,H12,H15)","v":0},{"$f":"D20-E20","v":0},{"$f":"(C20*10^10)+((F20+50)*10^6)+(D20*10)+A20","v":50000002},{"$f":"SUM(R19,S20,S23)","v":0},{"$f":"SUM(T19,U20,U23)","v":0},{"$f":"SUM(V19,W20,W23)","v":0},{"$f":"LARGE(G$19:J$22,A20)","v":50000003},null,{"$f":"MATCH(K20,G$19:G$22,0)","v":3},null,null,null,"Bélgica",0,0,"","",0,0,"Rússia"]
[3,{"$f":"K11","v":"Coreia do Sul"},{"$f":"SUM(N11,M13,M14)","v":0},{"$f":"SUM(J11,H13,H14)","v":0},{"$f":"SUM(H11,J13,J14)","v":0},0,50000003,{"$f":"SUM(S19,R21,R22)","v":0},{"$f":"SUM(U19,T21,T22)","v":0},{"$f":"SUM(W19,V21,V22)","v":0},50000002,null,2,null,null,null,"Coreia do Sul",0,0,"","",0,0,"Argélia"]
[4,{"$f":"K10","v":"Argélia"},{"$f":"SUM(N10,N13,M15)","v":0},{"$f":"SUM(J10,J13,H15)","v":0},{"$f":"SUM(H10,H13,J15)","v":0},0,50000004,{"$f":"SUM(S18,S21,R23)","v":0},{"$f":"SUM(U18,U21,T23)","v":0},{"$f":"SUM(W18,W21,V23)","v":0},50000001,null,1,null,null,null,"Coreia do Sul",0,0,"","",0,0,"Bélgica"]
[null,null,null,null,null,{"$f":"SUM(F19:F22)","v":0},null,null,null,null,null,null,null,null,null,null,"Argélia",0,0,"","",0,0,"Rússia"]

{"sheet":"8°'s e 4°'s","index":9,"n_rows":22,"n_cols":27,"rows_kept":22,"cut":false,"hidden":false,"merged":[[12,17,12,18],[9,19,9,20],[10,19,10,20],[11,19,11,20],[12,19,12,20],[9,26,9,27],[10,26,10,27],[11,26,11,27],[12,26,12,27],[16,3,16,4],[9,17,9,18],[10,17,10,18],[11,17,11,18],[14,12,14,13],[15,12,15,13],[16,12,16,13],[9,3,9,4],[10,3,10,4],[11,3,11,4],[12,3,12,4],[13,3,13,4],[7,1,7,13],[8,8,8,10],[8,17,8,18],[8,19,8,20],[8,26,8,27],[7,15,7,27],[8,3,8,4],[8,5,8,6],[8,12,8,13],[8,22,8,24],[14,3,14,4],[15,3,15,4],[12,5,12,6],[13,5,13,6],[14,5,14,6],[15,5,15,6],[16,5,16,6],[9,12,9,13],[10,12,10,13],[11,12,11,13],[12,12,12,13],[13,12,13,13],[9,5,9,6],[10,5,10,6],[11,5,11,6]]}
[]
[]
[]
[]
[]
[]
[]
[null,"Oitavas de Final",null,null,null,null,null,null,null,null,null,null,null,null,null,"Quartas de Final"]
[null,"Data","Hora","Local",null,"Seleção",null,"P","Placar",null,null,"P","Seleção",null,null,"Data","Hora","Local",null,"Seleção",null,"P","Placar",null,null,"P","Seleção"]
[null,"2014-06-28","13:00:00","Belo Horizonte",null,{"$f":"IF('Grupo A'!R10=0,\"\",'Grupo A'!P10)","v":""},null,null,null,"x",null,null,{"$f":"IF('Grupo B'!R10=0,\"\",'Grupo B'!P11)","v":""},null,null,"2014-07-04","17:00:00","Fortaleza",null,{"$f":"IF(OR(P15=Q15,Q15=P15),\"\",IF(P15>Q15,F10,IF(Q15>P15,M10)))","v":""},null,null,null,"x",null,null,{"$f":"IF(OR(P16=Q16,P16=Q16),\"\",IF(P16>Q16,F11,IF(Q16>P16,M11)))","v":""}]
[null,"2014-06-28","17:00:00","Rio de Janeiro",null,{"$f":"IF('Grupo C'!R10=0,\"\",'Grupo C'!P10)","v":""},null,null,null,"x",null,null,{"$f":"IF('Grupo D'!R10=0,\"\",'Grupo D'!P11)","v":""},null,null,"2014-07-04","13:00:00","Rio de Janeiro",null,{"$f":"IF(OR(P17=Q17,Q17=P17),\"\",IF(P17>Q17,F12,IF(Q17>P17,M12)))","v":""},null,null,null,"x",null,null,{"$f":"IF(OR(P18=Q18,Q18=P18),\"\",IF(P18>Q18,F13,IF(Q18>P18,M13)))","v":""}]
[null,"2014-06-30","13:00:00","Brasília",null,{"$f":"IF('Grupo E'!R10=0,\"\",'Grupo E'!P10)","v":""},null,null,null,"x",null,null,{"$f":"IF('Grupo F'!R10=0,\"\",'Grupo F'!P11)","v":""},null,null,"2014-07-05","17:00:00","Salvador",null,{"$f":"IF(OR(P19=Q19,Q19=P19),\"\",IF(P19>Q19,F14,IF(Q19>P19,M14)))","v":""},null,null,null,"x",null,null,{"$f":"IF(OR(P20=Q20,Q20=P20),\"\",IF(P20>Q20,F15,IF(Q20>P20,M15)))","v":""}]
[null,"2014-06-30","17:00:00","Porto Alegre",null,{"$f":"IF('Grupo G'!R10=0,\"\",'Grupo G'!P10)","v":""},null,null,null,"x",null,null,{"$f":"IF('Grupo H'!R10=0,\"\",'Grupo H'!P11)","v":""},null,null,"2014-07-05","13:00:00","Brasília",null,{"$f":"IF(OR(P21=Q21,Q21=P21),\"\",IF(P21>Q21,F16,IF(Q21>P21,M16)))","v":""},null,null,null,"x",null,null,{"$f":"IF(OR(P22=Q22,Q22=P22),\"\",IF(P22>Q22,F17,IF(Q22>P22,M17)))","v":""}]
[null,"2014-06-29","13:00:00","Fortaleza",null,{"$f":"IF('Grupo B'!R10=0,\"\",'Grupo B'!P10)","v":""},null,null,null,"x",null,null,{"$f":"IF('Grupo A'!R10=0,\"\",'Grupo A'!P11)","v":""}]
[null,"2014-06-29","17:00:00","Recife",null,{"$f":"IF('Grupo D'!R10=0,\"\",'Grupo D'!P10)","v":""},null,null,null,"x",null,null,{"$f":"IF('Grupo C'!R10=0,\"\",'Grupo C'!P11)","v":""},null,null,{"$f":"SUM(H10:I10)","v":0},{"$f":"SUM(K10:L10)","v":0},null,null,{"$f":"SUM(V10:W10)","v":0},{"$f":"SUM(Y10:Z10)","v":0}]
[null,"2014-07-01","13:00:00","São Paulo",null,{"$f":"IF('Grupo F'!R10=0,\"\",'Grupo F'!P10)","v":""},null,null,null,"x",null,null,{"$f":"IF('Grupo E'!R10=0,\"\",'Grupo E'!P11)","v":""},null,null,{"$f":"SUM(H11:I11)","v":0},{"$f":"SUM(K11:L11)","v":0},null,null,{"$f":"SUM(V11:W11)","v":0},{"$f":"SUM(Y11:Z11)","v":0}]
[null,"2014-07-01","17:00:00","Salvador",null,{"$f":"IF('Grupo H'!R10=0,\"\",'Grupo H'!P10)","v":""},null,null,null,"x",null,null,{"$f":"IF('Grupo G'!R10=0,\"\",'Grupo G'!P11)","v":""},null,null,0,0,null,null,0,0]
[null,null,null,null,null,null,null,null,null,null,null,null,null,null,null,0,0,null,null,0,0]
[null,null,null,null,null,null,null,null,null,null,null,null,null,null,null,0,0]
[null,null,null,null,null,null,null,null,null,null,null,null,null,null,null,0,0]
[null,null,null,null,null,null,null,null,null,null,null,null,null,null,null,0,0]
[null,null,null,null,null,null,null,null,null,null,null,null,null,null,null,0,0]

{"sheet":"Finais","index":10,"n_rows":18,"n_cols":27,"rows_kept":18,"cut":false,"hidden":false,"merged":[[17,5,17,6],[13,1,13,2],[14,1,14,2],[15,1,15,4],[16,1,16,4],[17,1,17,4],[15,5,15,6],[13,17,13,18],[13,19,13,20],[13,22,13,24],[13,26,13,27],[14,17,14,18],[14,19,14,20],[14,26,14,27],[15,12,15,13],[16,5,16,6],[16,12,16,13],[13,3,13,4],[13,5,13,6],[14,3,14,4],[14,5,14,6],[14,12,14,13],[12,3,12,4],[12,5,12,6],[12,15,12,27],[11,3,11,4],[11,5,11,6],[11,12,11,13],[11,17,11,18],[11,19,11,20],[11,26,11,27],[10,26,10,27],[9,3,9,4],[9,5,9,6],[9,12,9,13],[9,17,9,18],[9,19,9,20],[9,26,9,27],[10,3,10,4],[10,5,10,6],[10,12,10,13],[10,17,10,18],[10,19,10,20],[7,1,7,13],[7,15,7,27],[8,3,8,4],[8,5,8,6],[8,8,8,10],[8,12,8,13],[8,17,8,18],[8,19,8,20],[8,22,8,24],[8,26,8,27]]}
[]
[]
[]
[]
[]
[]
[]
[null,"Semi-Finais",null,null,null,null,null,null,null,null,null,null,null,null,null,"Final"]
[null,"Data","Hora","Local",null,"Seleção",null,"P","Placar",null,null,"P","Seleção",null,null,"Data","Hora","Local",null,"Seleção",null,"P","Placar",null,null,"P","Seleção"]
[null,"2014-07-08","17:00:00","Belo Horizonte",null,{"$f":"IF(OR('8°''s e 4°''s'!T15='8°''s e 4°''s'!U15,'8°''s e 4°''s'!U15='8°''s e 4°''s'!T15),\"\",IF('8°''s e 4°''s'!T15>'8°''s e 4°''s'!U15,'8°''s e 4°''s'!T10,IF('8°''s e 4°''s'!U15>'8°''s e 4°''s'!T15,'8°''s e 4°''s'!AA10)))","v":""},null,null,null,"x",null,null,{"$f":"IF(OR('8°''s e 4°''s'!T16='8°''s e 4°''s'!U16,'8°''s e 4°''s'!U16='8°''s e 4°''s'!T16),\"\",IF('8°''s e 4°''s'!T16>'8°''s e 4°''s'!U16,'8°''s e 4°''s'!T11,IF('8°''s e 4°''s'!U16>'8°''s e 4°''s'!T16,'8°''s e 4°''s'!AA11)))","v":""},null,null,"2014-07-13","16:00:00","Rio de Janeiro",null,{"$f":"IF(OR(M13=N13,N13=M13),\"\",IF(M13>N13,F10,IF(N13>M13,M10)))","v":""},null,null,null,"x",null,null,{"$f":"IF(OR(M14=N14,N14=M14),\"\",IF(M14>N14,F11,IF(N14>M14,M11)))","v":""}]
[null,"2014-07-09","13:00:00","São Paulo",null,{"$f":"IF(OR('8°''s e 4°''s'!T17='8°''s e 4°''s'!U17,'8°''s e 4°''s'!U17='8°''s e 4°''s'!T17),\"\",IF('8°''s e 4°''s'!T17>'8°''s e 4°''s'!U17,'8°''s e 4°''s'!T12,IF('8°''s e 4°''s'!U17>'8°''s e 4°''s'!T17,'8°''s e 4°''s'!AA12)))","v":""},null,null,null,"x",null,null,{"$f":"IF(OR('8°''s e 4°''s'!T18='8°''s e 4°''s'!U18,'8°''s e 4°''s'!U18='8°''s e 4°''s'!T18),\"\",IF('8°''s e 4°''s'!T18>'8°''s e 4°''s'!U18,'8°''s e 4°''s'!T13,IF('8°''s e 4°''s'!U18>'8°''s e 4°''s'!T18,'8°''s e 4°''s'!AA13)))","v":""},null,null,null,null,null,null,null,null,null,{"$f":"SUM(V10:W10)","v":0},null,{"$f":"SUM(Y10:Z10)","v":0}]
[]
[null,null,null,null,null,null,null,null,null,null,null,null,{"$f":"SUM(H10:I10)","v":0},{"$f":"SUM(K10:L10)","v":0},null,"Decisão pelo Terceiro Lugar"]
[null,null,null,null,null,null,null,null,null,null,null,null,{"$f":"SUM(H11:I11)","v":0},{"$f":"SUM(K11:L11)","v":0},null,"Data","Hora","Local",null,"Seleção",null,"P","Placar",null,null,"P","Seleção"]
[null,null,null,null,null,null,null,null,null,null,null,null,null,null,null,"2014-07-12","17:00:00","Brasília",null,{"$f":"IF(OR(M13=N13,N13=M13),\"\",IF(M13<N13,F10,IF(N13<M13,M10)))","v":""},null,null,null,"x",null,null,{"$f":"IF(OR(M14=N14,N14=M14),\"\",IF(M14<N14,F11,IF(N14<M14,M11)))","v":""}]
[null,"Campeão →",null,null,null,{"$f":"IF(OR(W11=Y11,Y11=W11),\"\",IF(W11>Y11,T10,IF(Y11>W11,AA10)))","v":""},null,null,null,null,null,null,null,null,null,null,null,null,null,null,null,null,{"$f":"SUM(V15:W15)","v":0},null,{"$f":"SUM(Y15:Z15)","v":0}]
[null,"Vice Campeão →",null,null,null,{"$f":"IF(OR(W11=Y11,Y11=W11),\"\",IF(W11<Y11,T10,IF(Y11<W11,AA10)))","v":""}]
[null,"Terceiro Lugar →",null,null,null,{"$f":"IF(OR(W16=Y16,Y16=W16),\"\",IF(W16>Y16,T15,AA15))","v":""}]